(Xe)8..I anion
- Formula: IXe8-
- Molecular weight: 1177.249

Ion clustering data

Data compiled by: John E. Bartmess
Clustering reactions
IXe7- + 8 = IXe8-
By formula: IXe7- + 8Xe = IXe8-
Quantity | Value | Units | Method | Reference | Comment |
---|---|---|---|---|---|
ΔrH° | 1.20 ± 0.90 | kcal/mol | N/A | Becker, Markovich, et al., 1997 | gas phase; Stated electron affinity is the Vertical Detachment Energy |
IXe8- + 9 = IXe9-
By formula: IXe8- + 9Xe = IXe9-
Quantity | Value | Units | Method | Reference | Comment |
---|---|---|---|---|---|
ΔrH° | 0.90 ± 0.90 | kcal/mol | N/A | Becker, Markovich, et al., 1997 | gas phase; Stated electron affinity is the Vertical Detachment Energy |

Reaction thermochemistry data

Data compiled by: John E. Bartmess

Individual Reactions

IXe7- + 8Xenon = IXe8-

By formula: IXe7- + 8Xe = IXe8-

Quantity Value Units Method Reference Comment
Δr5.0 ± 3.8kJ/molN/ABecker, Markovich, et al., 1997gas phase; Stated electron affinity is the Vertical Detachment Energy

IXe8- + 9Xenon = IXe9-

By formula: IXe8- + 9Xe = IXe9-

Quantity Value Units Method Reference Comment
Δr3.8 ± 3.8kJ/molN/ABecker, Markovich, et al., 1997gas phase; Stated electron affinity is the Vertical Detachment Energy

References

Becker, Markovich, et al., 1997
Becker, I.; Markovich, G.; Chesnovsky, O.,
Bound Delocalized Excited States in I-Xen Clusters.,
Phys. Rev. Lett., 1997, 79, 18, 3391, https://doi.org/10.1103/PhysRevLett.79.3391
. [all data]