(Xe)6..I anion
- Formula: IXe6-
- Molecular weight: 914.663

Gas phase ion energetics data

Data compiled by: John E. Bartmess
Electron affinity of neutral species
EAneutral (eV) | Method | Reference | Comment |
---|---|---|---|
3.4230 ± 0.0060 | LPES | Pivonka, Lenzer, et al., 2001 | Vertical Detachment Energy:3.446±0.008 eV |
3.460 ± 0.020 | LPES | Becker, Markovich, et al., 1997 | Stated electron affinity is the Vertical Detachment Energy |

Reaction thermochemistry data

Data compiled by: John E. Bartmess

Individual Reactions

IXe5- + 6Xenon = IXe6-

By formula: IXe5- + 6Xe = IXe6-

Quantity Value Units Method Reference Comment
Δr5.0 ± 3.8kJ/molN/ABecker, Markovich, et al., 1997gas phase; Stated electron affinity is the Vertical Detachment Energy

IXe6- + 7Xenon = IXe7-

By formula: IXe6- + 7Xe = IXe7-

Quantity Value Units Method Reference Comment
Δr5.0 ± 3.8kJ/molN/ABecker, Markovich, et al., 1997gas phase; Stated electron affinity is the Vertical Detachment Energy

References

Pivonka, Lenzer, et al., 2001
Pivonka, N.L.; Lenzer, T.; Furlanetto, M.R.; Neumark, D.M.,
Photoelectron spectroscopy of XenI- clusters (n = 13),
Chem. Phys., 2001, 334, 24-30. [all data]
Becker, Markovich, et al., 1997
Becker, I.; Markovich, G.; Chesnovsky, O.,
Bound Delocalized Excited States in I-Xen Clusters.,
Phys. Rev. Lett., 1997, 79, 18, 3391, https://doi.org/10.1103/PhysRevLett.79.3391
. [all data]