2,4,6-triMe-benzoate anion

Gas phase ion energetics data

Data compiled by: John E. Bartmess

Electron affinity of neutral species

EAneutral (eV) Method Reference Comment
3.80 ± 0.16D-EADecouzon, Ertl, et al., 1993relative to benzoate at 333.0 kcal/mol

Protonation reactions

C10H11O2- + Hydrogen cation = Benzoic acid, 2,4,6-trimethyl-

By formula: C10H11O2- + H+ = C10H12O2

Quantity Value Units Method Reference Comment
Δr1418. ± 8.8kJ/molG+TSDecouzon, Ertl, et al., 1993gas phase; relative to benzoate at 333.0 kcal/mol
Quantity Value Units Method Reference Comment
Δr1389. ± 8.4kJ/molIMREDecouzon, Ertl, et al., 1993gas phase; relative to benzoate at 333.0 kcal/mol

References

Decouzon, Ertl, et al., 1993
Decouzon, M.; Ertl, P.; Exner, O.; Gal, J.F.; Maria, P.C., Concepts of Sterically Hindered Resonance and Buttressing Effect - Gas-Phase Acidities of Methyl-Substituted Benzoic Acids and Basicities of, J. Am. Chem. Soc., 1993, 115, 25, 12071, https://doi.org/10.1021/ja00078a052 . [all data]