L-Valine anion

Reaction thermochemistry data

Data compiled by: John E. Bartmess

Individual Reactions

C5H10NO2- + Hydrogen cation = Valine

By formula: C5H10NO2- + H+ = C5H11NO2

Quantity Value Units Method Reference Comment
Δr1431. ± 7.9kJ/molCIDCJones, Bernier, et al., 2007gas phase
Δr1420. ± 13.kJ/molG+TSO'Hair, Bowie, et al., 1992gas phase
Quantity Value Units Method Reference Comment
Δr1391. ± 13.kJ/molCIDCO'Hair, Bowie, et al., 1992gas phase

C5H10NO2- + Water = C5H12NO3-

By formula: C5H10NO2- + H2O = C5H12NO3-

Quantity Value Units Method Reference Comment
Δr59.8 ± 1.7kJ/molN/AWincel, 2008gas phase
Quantity Value Units Method Reference Comment
Δr30.1 ± 2.9kJ/molTDAsWincel, 2008gas phase

References

Jones, Bernier, et al., 2007
Jones, C.M.; Bernier, M.; Carson, E.; Colyer, K.E.; Metz, R.; Pawlow, A.; Wischow, E.D.; Webb, I.; Andriole, E.J.; Poutsma, J.C., Gas-phase Acities of the 20 Protein Amino Acids, Int. J. Mass Spectrom., 2007, 267, 1-3, 54-62, https://doi.org/10.1016/j.ijms.2007.02.018 . [all data]

O'Hair, Bowie, et al., 1992
O'Hair, R.J.; Bowie, J.H.; Gronert, S., Gas Phase Acidity of the alpha-Amino Acids, Int. J. Mass Spectrom. Ion Proc., 1992, 117, 23, https://doi.org/10.1016/0168-1176(92)80083-D . [all data]

Wincel, 2008
Wincel, H., Hydration energies of deprotonated amino acids from gas phase equilibria measurements, J. Am. Soc. Mass Spectrom., 2008, 19, 8, 1091-1097, https://doi.org/10.1016/j.jasms.2008.05.014 . [all data]