CH2=CHCH(SiMe3) anion

Reaction thermochemistry data

Data compiled by: John E. Bartmess

Individual Reactions

C6H13Si- + Hydrogen cation = Silane, trimethyl-2-propenyl-

By formula: C6H13Si- + H+ = C6H14Si

Quantity Value Units Method Reference Comment
Δr<1592.3 ± 3.8kJ/molG+TSDePuy, Bierbaum, et al., 1980gas phase; More acidic than MeOH. Computations indicate dGacid ca. 367 kcal/mol
Quantity Value Units Method Reference Comment
Δr<1564.8kJ/molIMRBDePuy, Bierbaum, et al., 1980gas phase; More acidic than MeOH. Computations indicate dGacid ca. 367 kcal/mol

References

DePuy, Bierbaum, et al., 1980
DePuy, C.H.; Bierbaum, V.M.; Flippin, L.A.; Brabowski, J.J.; King, G.K.; Schmidt, R.J.; Sullivan, S.A., Gas phase reactions of anions with substituted silanes, J. Am. Chem. Soc., 1980, 102, 5012. [all data]