(Na)[Mo(Cp*)(CO)3]

Reaction thermochemistry data

Data compiled by: José A. Martinho Simões

Individual Reactions

0.5C26H30Mo2O6 (solution) + sodium (cr) = C13H15MoNaO3 (solution)

By formula: 0.5C26H30Mo2O6 (solution) + Na (cr) = C13H15MoNaO3 (solution)

Quantity Value Units Method Reference Comment
Δr-250.6 ± 6.0kJ/molRSCKiss, Nolan, et al., 1994solvent: Tetrahydrofuran; The reaction enthalpy was calculated from the enthalpies of the following reactions: 0.5[Mo(Cp*)(CO)3]2(solution) + (Na)[Cr(Cp)(CO)2(PPh3)](solution) = (Na)[Mo(Cp*)(CO)3](solution) + Cr(Cp)(CO)2(PPh3)(solution), Cr(Cp)(CO)2(PPh3)(solution) + (Na)(Ph2CO)(solution) = (Na)[Cr(Cp)(CO)2(PPh3)](solution) + Ph2CO(solution), -89.1 ± 2.5 kJ/mol, and Ph2CO(solution) + Na(cr) = (Na)(Ph2CO)(solution), -161.1 ± 2.5 kJ/mol Kiss, Nolan, et al., 1994.

References

Kiss, Nolan, et al., 1994
Kiss, G.; Nolan, S.P.; Hoff, C.D., Inorg. Chim. Acta, 1994, 227, 285. [all data]