Pd(Cl)2(py)(C2H4)

Reaction thermochemistry data

Data compiled by: José A. Martinho Simões

Individual Reactions

C7H9Cl2NPd (solution) + 1,3-Diazine (l) = (PdCl2(C5H5N)2) (solution) + Ethylene (solution)

By formula: C7H9Cl2NPd (solution) + C4H4N2 (l) = (PdCl2(C5H5N)2) (solution) + C2H4 (solution)

Quantity Value Units Method Reference Comment
Δr-57.7 ± 1.7kJ/molRSCPartenheimer and Durham, 1974solvent: Dichloromethane

References

Partenheimer and Durham, 1974
Partenheimer, W.; Durham, B., J. Am. Chem. Soc., 1974, 96, 3800. [all data]