Mg(Br)(Bu)

Reaction thermochemistry data

Data compiled by: José A. Martinho Simões

Individual Reactions

C4H9BrMg (solution) + Hydrogen bromide (g) = Butane (solution) + Br2Mg (solution)

By formula: C4H9BrMg (solution) + HBr (g) = C4H10 (solution) + Br2Mg (solution)

Quantity Value Units Method Reference Comment
Δr-292.5 ± 2.2kJ/molRSCHolm, 1981solvent: Diethyl ether

References

Holm, 1981
Holm, T., J. Chem. Soc., Perkin Trans. II, 1981, 464.. [all data]