NaOPh
- Formula: C6H5NaO
- Molecular weight: 116.0931

Condensed phase thermochemistry data

Data compiled by: José A. Martinho Simões
Quantity | Value | Units | Method | Reference | Comment |
---|---|---|---|---|---|
ΔfH°solid | -78.06 ± 0.88 | kcal/mol | Review | Martinho Simões | |
ΔfH°solid | -79.3 ± 1.4 | kcal/mol | Review | Martinho Simões | |
ΔfH°solid | -78.68 ± 0.81 | kcal/mol | Review | Martinho Simões | Selected data. Average of the values from Leal, Pires de Matos, et al., 1991 |

Reaction thermochemistry data

Data compiled by: José A. Martinho Simões

Individual Reactions

C6H5NaO (cr) + (Hydrogen chloride • 552Water) (solution) = Phenol (cr) + sodium chloride (cr)

By formula: C6H5NaO (cr) + (HCl • 552H2O) (solution) = C6H6O (cr) + ClNa (cr)

Quantity Value Units Method Reference Comment
Δr-78.0 ± 5.7kJ/molRSCLeal, Pires de Matos, et al., 1991

C6H5NaO (cr) + Water (l) = Phenol (cr) + Sodium hydroxide (cr)

By formula: C6H5NaO (cr) + H2O (l) = C6H6O (cr) + HNaO (cr)

Quantity Value Units Method Reference Comment
Δr21.4 ± 3.6kJ/molRSCLeal, Pires de Matos, et al., 1991

References

Martinho Simões
Martinho Simões, J.A.,
Private communication (see http://webbook.nist.gov/chemistry/om/). [all data]
Leal, Pires de Matos, et al., 1991
Leal, J.P.; Pires de Matos, A.; Martinho Simões, J.A.,
J. Organometal. Chem., 1991, 403, 1. [all data]