nitrophenide anion

Gas phase ion energetics data

Data compiled by: John E. Bartmess

Protonation reactions

C6H4NO2- + Hydrogen cation = Benzene, nitro-

By formula: C6H4NO2- + H+ = C6H5NO2

Quantity Value Units Method Reference Comment
Δr1577. ± 13.kJ/molG+TSCheng and Grabowski, 1989gas phase; between EtOH, iPrOH
Δr1482. ± 13.kJ/molG+TSMeot-ner and Kafafi, 1988gas phase; acidity stronger than all levels of computation by 25 kcal/mol
Quantity Value Units Method Reference Comment
Δr1545. ± 13.kJ/molIMRBCheng and Grabowski, 1989gas phase; between EtOH, iPrOH
Δr1450. ± 13.kJ/molIMRBMeot-ner and Kafafi, 1988gas phase; acidity stronger than all levels of computation by 25 kcal/mol

Reaction thermochemistry data

Data compiled by: John E. Bartmess

Individual Reactions

C6H4NO2- + Hydrogen cation = Benzene, nitro-

By formula: C6H4NO2- + H+ = C6H5NO2

Quantity Value Units Method Reference Comment
Δr1577. ± 13.kJ/molG+TSCheng and Grabowski, 1989gas phase; between EtOH, iPrOH
Δr1482. ± 13.kJ/molG+TSMeot-ner and Kafafi, 1988gas phase; acidity stronger than all levels of computation by 25 kcal/mol
Quantity Value Units Method Reference Comment
Δr1545. ± 13.kJ/molIMRBCheng and Grabowski, 1989gas phase; between EtOH, iPrOH
Δr1450. ± 13.kJ/molIMRBMeot-ner and Kafafi, 1988gas phase; acidity stronger than all levels of computation by 25 kcal/mol

References

Cheng and Grabowski, 1989
Cheng, X.; Grabowski, J.J., Gas-phase Acidity of Nitrobenzene from Flowing Afterglow Bracketing Studies, Rapid Commun. Mass Spectrom., 1989, 3, 2, 34-36, https://doi.org/10.1002/rcm.1290030207 . [all data]

Meot-ner and Kafafi, 1988
Meot-ner, M.; Kafafi, S.A., Carbon Acidities of Aromatic Compounds, J. Am. Chem. Soc., 1988, 110, 19, 6297, https://doi.org/10.1021/ja00227a003 . [all data]