Benzamide, 3,4-difluoro-N-(3,4-difluorobenzoyl)-N-(hept-2-yl)-
- Formula: C21H21F4NO2
- Molecular weight: 395.3906
- IUPAC Standard InChIKey: ZBCHDYANTVERIW-UHFFFAOYSA-N
- Chemical structure:

Van Den Dool and Kratz RI, non-polar column, temperature ramp

Column type | Active phase | I | Reference | Comment |
---|---|---|---|---|
Capillary | 5 % Phenyl methyl siloxane | 2155. | Zaikin, 2013 | 30. m/0.25 mm/0.25 μm, 15. K/min, 270. C @ 15. min; Tstart: 60. C |

References

Zaikin, 2013
Zaikin, V.G.,
Personal communication: Retention indices measured during 2013, 2013. [all data]