Benzamide, 2,4,5-trifluoro-3-methoxy-N-(2,4,5-trifluoro-3-methoxybenzoyl)-N-octyl-
- Formula: C24H25F6NO4
- Molecular weight: 505.4500
- IUPAC Standard InChIKey: BZVPEGMJNZLINJ-UHFFFAOYSA-N
- Chemical structure:

Van Den Dool and Kratz RI, non-polar column, temperature ramp

Column type | Active phase | I | Reference | Comment |
---|---|---|---|---|
Capillary | 5 % Phenyl methyl siloxane | 2616. | Zaikin, 2013 | 30. m/0.25 mm/0.25 μm, 15. K/min, 270. C @ 15. min; Tstart: 60. C |

References

Zaikin, 2013
Zaikin, V.G.,
Personal communication: Retention indices measured during 2013, 2013. [all data]