Benzeneacetic acid, 4-chloro-, 2,7-dimethyloct-1-en-3-yn-5-yl ester
- Formula: C18H21ClO2
- Molecular weight: 304.811
- IUPAC Standard InChIKey: VYHJSUIXIQWEML-UHFFFAOYSA-N
- Chemical structure:

Van Den Dool and Kratz RI, non-polar column, temperature ramp

Column type | Active phase | I | Reference | Comment |
---|---|---|---|---|
Capillary | 5 % Phenyl methyl siloxane | 2021. | Zaikin, 2013 | 30. m/0.25 mm/0.25 μm, 15. K/min, 270. C @ 15. min; Tstart: 60. C |

References

Zaikin, 2013
Zaikin, V.G.,
Personal communication: Retention indices measured during 2013, 2013. [all data]