Pimelic acid, 5-methoxy-3-methylpent-2-yl 4-methyl-2-pentyl ester
- Formula: C20H38O5
- Molecular weight: 358.5127
- IUPAC Standard InChIKey: HMGRUGQLTQFHOZ-UHFFFAOYSA-N
- Chemical structure:

Van Den Dool and Kratz RI, non-polar column, temperature ramp

Column type | Active phase | I | Reference | Comment |
---|---|---|---|---|
Capillary | 5 % Phenyl methyl siloxane | 2221. | Zaikin, 2013 | 30. m/0.25 mm/0.25 μm, 15. K/min, 270. C @ 15. min; Tstart: 60. C |

References

Zaikin, 2013
Zaikin, V.G.,
Personal communication: Retention indices measured during 2013, 2013. [all data]