Fumaric acid, 2-isopropoxyphenyl 2,2,3,3,4,4,5,5-octafluoropentyl ester
- Formula: C18H16F8O5
- Molecular weight: 464.3039
- IUPAC Standard InChIKey: FGZCOVXFCXJZBE-BQYQJAHWSA-N
- Chemical structure:

Van Den Dool and Kratz RI, non-polar column, temperature ramp

Column type | Active phase | I | Reference | Comment |
---|---|---|---|---|
Capillary | 5 % Phenyl methyl siloxane | 1967. | Zaikin, 2013 | 30. m/0.25 mm/0.25 μm, 15. K/min, 270. C @ 15. min; Tstart: 60. C |

References

Zaikin, 2013
Zaikin, V.G.,
Personal communication: Retention indices measured during 2013, 2013. [all data]