Fumaric acid, 2,4,4-trimethylpentyl 2,3-dichlorophenyl ester
- Formula: C18H22Cl2O4
- Molecular weight: 373.271
- IUPAC Standard InChIKey: VQXNOVCJKSDXFJ-CMDGGOBGSA-N
- Chemical structure:

Van Den Dool and Kratz RI, non-polar column, temperature ramp

Column type | Active phase | I | Reference | Comment |
---|---|---|---|---|
Capillary | 5 % Phenyl methyl siloxane | 2471. | Zaikin, 2013 | 30. m/0.25 mm/0.25 μm, 15. K/min, 270. C @ 15. min; Tstart: 60. C |

References

Zaikin, 2013
Zaikin, V.G.,
Personal communication: Retention indices measured during 2013, 2013. [all data]