Glutaric acid, (cyclohex-3-enyl)methyl 2,2,3,3-tetrafluoropropyl ester
- Formula: C15H20F4O4
- Molecular weight: 340.3105
- IUPAC Standard InChIKey: HWCBGHUGMQPIGP-UHFFFAOYSA-N
- Chemical structure:

Van Den Dool and Kratz RI, non-polar column, temperature ramp

Column type | Active phase | I | Reference | Comment |
---|---|---|---|---|
Capillary | 5 % Phenyl methyl siloxane | 1826. | Zaikin, 2013 | 30. m/0.25 mm/0.25 μm, 15. K/min, 270. C @ 15. min; Tstart: 60. C |

References

Zaikin, 2013
Zaikin, V.G.,
Personal communication: Retention indices measured during 2013, 2013. [all data]