Glutaric acid, (2-chlorocyclohexyl)methyl but-3-yn-2-yl ester
- Formula: C16H23ClO4
- Molecular weight: 314.804
- IUPAC Standard InChIKey: GSHXLKDRXZKNSM-UHFFFAOYSA-N
- Chemical structure:

Van Den Dool and Kratz RI, non-polar column, temperature ramp

Column type | Active phase | I | Reference | Comment |
---|---|---|---|---|
Capillary | 5 % Phenyl methyl siloxane | 2166. | Zaikin, 2013 | 30. m/0.25 mm/0.25 μm, 15. K/min, 270. C @ 15. min; Tstart: 60. C |

References

Zaikin, 2013
Zaikin, V.G.,
Personal communication: Retention indices measured during 2013, 2013. [all data]