Glutaric acid, pent-2-en-1-yl 1,1,1-trifluoroprop-2-yl ester
- Formula: C13H19F3O4
- Molecular weight: 296.2828
- IUPAC Standard InChIKey: KKKVVKOMSZVLEC-SNAWJCMRSA-N
- Chemical structure:

Van Den Dool and Kratz RI, non-polar column, temperature ramp

Column type | Active phase | I | Reference | Comment |
---|---|---|---|---|
Capillary | 5 % Phenyl methyl siloxane | 1470. | Zaikin, 2013 | 30. m/0.25 mm/0.25 μm, 15. K/min, 270. C @ 15. min; Tstart: 60. C |

References

Zaikin, 2013
Zaikin, V.G.,
Personal communication: Retention indices measured during 2013, 2013. [all data]