Glutaric acid, but-3-en-2-yl 2-chloro-6-fluorophenyl ester
- Formula: C15H16ClFO4
- Molecular weight: 314.737
- IUPAC Standard InChIKey: KJDFQKBPAZVRBW-UHFFFAOYSA-N
- Chemical structure:

Van Den Dool and Kratz RI, non-polar column, temperature ramp

Column type | Active phase | I | Reference | Comment |
---|---|---|---|---|
Capillary | 5 % Phenyl methyl siloxane | 1977. | Zaikin, 2013 | 30. m/0.25 mm/0.25 μm, 15. K/min, 270. C @ 15. min; Tstart: 60. C |

References

Zaikin, 2013
Zaikin, V.G.,
Personal communication: Retention indices measured during 2013, 2013. [all data]