Succinic acid, 2,2,3,3-tetrafluoropropyl cis-4-methylcyclohexyl ester
- Formula: C14H20F4O4
- Molecular weight: 328.2998
- IUPAC Standard InChIKey: VYKIQYFLEARILO-UHFFFAOYSA-N
- Chemical structure:

Van Den Dool and Kratz RI, non-polar column, temperature ramp

Column type | Active phase | I | Reference | Comment |
---|---|---|---|---|
Capillary | 5 % Phenyl methyl siloxane | 1670. | Zaikin, 2012 | 30. m/0.25 mm/0.25 μm, 15. K/min, 270. C @ 15. min; Tstart: 60. C |

References

Zaikin, 2012
Zaikin, V.G.,
Personal communication: Retention indices measured during 2012, 2012. [all data]