3-Amino-3-(2-chlorophenyl)propionic acid, N-dimethylaminomethylene-, ethyl ester
- Formula: C14H19ClN2O2
- Molecular weight: 282.766
- IUPAC Standard InChIKey: KPCDELOTIFFKIP-UHFFFAOYSA-N
- Chemical structure:

Van Den Dool and Kratz RI, non-polar column, custom temperature program

Column type | Active phase | I | Reference | Comment |
---|---|---|---|---|
Capillary | VF-5MS | 1961. | Tretyakov, 2011 | 30. m/0.25 mm/0.25 μm, He; Program: Multi-step temperature program; T(initial)=60C; T(final)=270C |

References

Tretyakov, 2011
Tretyakov, K.V.,
Retention Data. NIST Mass Spectrometry Data Center., NIST Mass Spectrometry Data Center, 2011. [all data]