Ethyl 3-(chlorocarbonyl)bicyclo[2.2.1]hept-5-ene-2-carboxylate
- Formula: C11H13ClO3
- Molecular weight: 228.672
- IUPAC Standard InChIKey: UFJRFJAUWQRPBW-UHFFFAOYSA-N
- Chemical structure:

Van Den Dool and Kratz RI, non-polar column, custom temperature program

Column type | Active phase | I | Reference | Comment |
---|---|---|---|---|
Capillary | VF-5MS | 1479. | Tretyakov, 2011 | 30. m/0.25 mm/0.25 μm, He; Program: Multi-step temperature program; T(initial)=60C; T(final)=270C |

References

Tretyakov, 2011
Tretyakov, K.V.,
Retention Data. NIST Mass Spectrometry Data Center., NIST Mass Spectrometry Data Center, 2011. [all data]