3-Chlorobenzoic acid, 2-chloroethyl ester

Kovats' RI, non-polar column, isothermal

Data compiled by: NIST Mass Spectrometry Data Center, William E. Wallace, director

Column type CapillaryCapillaryCapillary
Active phase SE-30SE-30SE-30
Column length (m)
Carrier gas
Substrate
Column diameter (mm)
Phase thickness (μm)
Temperature (C) 140.160.180.
I 1535.1542.1555.
ReferenceKorhonen and Lind, 1985Korhonen and Lind, 1985Korhonen and Lind, 1985
Comment MSDC-RI MSDC-RI MSDC-RI

References

Korhonen and Lind, 1985
Korhonen, I.O.O.; Lind, M.A., Gas-liquid chromatographic analyses. XLI. Ethyl and ω-chloroethyl esters of benzoic and monochlorobenzoic acids on SE-30 and OV-351 capillary columns, J. Chromatogr., 1985, 325, 433-443, https://doi.org/10.1016/S0021-9673(00)96054-0 . [all data]