N-Hydroxy-3,4-(methylenedioxy)amphetamine, TMS derivative
- Formula: C13H21NO3Si
- Molecular weight: 267.3962
- IUPAC Standard InChIKey: MXAFNSUVVHTUMH-UHFFFAOYSA-N
- Chemical structure:
View 3d structure (requires JavaScript / HTML 5) - Other names: (.+/-.)-N-Hydroxy-3,4-methylenedioxyamphetamine, trimethylsilyl ether

Van Den Dool and Kratz RI, non-polar column, custom temperature program

Column type | Active phase | I | Reference | Comment |
---|---|---|---|---|
Capillary | VF-5MS | 1740.2 | Tret'yakov, 2008 | 30. m/0.25 mm/0.25 μm, He; Program: Multi-step temperature program; T(initial)=60C; T(final)=270C |

References

Tret'yakov, 2008
Tret'yakov, K.V.,
Retention Data. NIST Mass Spectrometry Data Center., NIST Mass Spectrometry Data Center, 2008. [all data]