3-Methylcatechol, 2TMS derivative
- Formula: C13H24O2Si2
- Molecular weight: 268.4995
- IUPAC Standard InChIKey: INBPVSVUSZJONB-UHFFFAOYSA-N
- Chemical structure:
View 3d structure (requires JavaScript / HTML 5) - Other names: 3-Methylcatechol, bis(trimethylsilyl) ether; 3-Methyl1,2-dihydroxybenzene, TMS

Van Den Dool and Kratz RI, non-polar column, custom temperature program

Column type | Active phase | I | Reference | Comment |
---|---|---|---|---|
Capillary | VF-5MS | 1398.5 | Tret'yakov, 2008 | 30. m/0.25 mm/0.25 μm, He; Program: Multi-step temperature program; T(initial)=60C; T(final)=270C |

Normal alkane RI, non-polar column, custom temperature program

Column type | Active phase | I | Reference | Comment |
---|---|---|---|---|
Capillary | SE-30 | 1403. | Zimmermann, Lauterbach, et al., 1985 | Program: not specified |

References

Tret'yakov, 2008
Tret'yakov, K.V.,
Retention Data. NIST Mass Spectrometry Data Center., NIST Mass Spectrometry Data Center, 2008. [all data]
Zimmermann, Lauterbach, et al., 1985
Zimmermann, V.; Lauterbach, M.; Jaeger, G.,
Analytical characterization phenolic compounds obtained from phenosolvan-extracts by use of gas-chromatography with capillary columns,
Chem. Tech. (Leipzig), 1985, 37, 11, 476-478. [all data]