3-[((1,1,3,3,5,5-Hexamethyl-5-[(3Z)-non-3-en-1-yloxy]trisiloxanyl)oxy)methyl]pyridine
- Formula: C21H41NO4Si3
- Molecular weight: 455.8110
- IUPAC Standard InChIKey: XQQIPTFRVXWNCW-SEYXRHQNSA-N
- Chemical structure:

Van Den Dool and Kratz RI, non-polar column, custom temperature program

Column type | Active phase | I | Reference | Comment |
---|---|---|---|---|
Capillary | VF-5MS | 2295.2 | Tret'yakov, 2008 | 30. m/0.25 mm/0.25 μm, He; Program: Multi-step temperature program; T(initial)=60C; T(final)=270C |

References

Tret'yakov, 2008
Tret'yakov, K.V.,
Retention Data. NIST Mass Spectrometry Data Center., NIST Mass Spectrometry Data Center, 2008. [all data]