Dimethyl(bis([5-methyl-2-(1-methylethenyl)hex-4-en-1-yl]oxy))silane
- Formula: C22H40O2Si
- Molecular weight: 364.6373
- IUPAC Standard InChIKey: JKKPDHCCLYFSKB-UHFFFAOYSA-N
- Chemical structure:

Van Den Dool and Kratz RI, non-polar column, custom temperature program

Column type | Active phase | I | Reference | Comment |
---|---|---|---|---|
Capillary | VF-5MS | 1911.4 | Tret'yakov, 2008 | 30. m/0.25 mm/0.25 μm, He; Program: Multi-step temperature program; T(initial)=60C; T(final)=270C |

References

Tret'yakov, 2008
Tret'yakov, K.V.,
Retention Data. NIST Mass Spectrometry Data Center., NIST Mass Spectrometry Data Center, 2008. [all data]