2-Fluoro-3-(trifluoromethyl)phenol, TBDMS derivative
- Formula: C13H18F4OSi
- Molecular weight: 294.3605
- IUPAC Standard InChIKey: FAFWUTVIHQCVBA-UHFFFAOYSA-N
- Chemical structure:
View 3d structure (requires JavaScript / HTML 5) - Other names: 2-Fluoro-3-(trifluoromethyl)phenol, tert-butyldimethylsilyl ether

Van Den Dool and Kratz RI, non-polar column, custom temperature program

Column type | Active phase | I | Reference | Comment |
---|---|---|---|---|
Capillary | VF-5MS | 1289.2 | Tret'yakov, 2008 | 30. m/0.25 mm/0.25 μm, He; Program: Multi-step temperature program; T(initial)=60C; T(final)=270C |

References

Tret'yakov, 2008
Tret'yakov, K.V.,
Retention Data. NIST Mass Spectrometry Data Center., NIST Mass Spectrometry Data Center, 2008. [all data]