4-Methoxycinnamic acid, TBDMS derivative
- Formula: C16H24O3Si
- Molecular weight: 292.4455
- IUPAC Standard InChIKey: WTFSSLFLLACRIS-FMIVXFBMSA-N
- Chemical structure:
View 3d structure (requires JavaScript / HTML 5) - Other names: 4-Methoxycinnamic acid, tert-butyldimethylsilyl ester; 4-Methoxycinnamic acid, TBDMS

Van Den Dool and Kratz RI, non-polar column, custom temperature program

Column type | Active phase | I | Reference | Comment |
---|---|---|---|---|
Capillary | VF-5MS | 2095.4 | Tret'yakov, 2008 | 30. m/0.25 mm/0.25 μm, He; Program: Multi-step temperature program; T(initial)=60C; T(final)=270C |

Normal alkane RI, non-polar column, temperature ramp

Column type | Active phase | I | Reference | Comment |
---|---|---|---|---|
Capillary | DB-5 | 2085. | Paik, Lee, et al., 2005 | 30. m/0.25 mm/0.25 μm, Helium, 60. C @ 2. min, 4. K/min; Tend: 290. C |

References

Tret'yakov, 2008
Tret'yakov, K.V.,
Retention Data. NIST Mass Spectrometry Data Center., NIST Mass Spectrometry Data Center, 2008. [all data]
Paik, Lee, et al., 2005
Paik, M.-J.; Lee, H.-J.; Kim, K.-R.,
Simultaneous retention index analysis of urinary amino acids and carboxylic acids for graphic recognition of abnormal state,
J. Chromatogr. B, 2005, 821, 1, 94-104, https://doi.org/10.1016/j.jchromb.2005.04.011
. [all data]