3,5-Di-tert-butyl-4-hydroxybenzoic acid, TMS derivative
- Formula: C18H30O3Si
- Molecular weight: 322.5145
- IUPAC Standard InChIKey: BJZSPZOYHFAVJV-UHFFFAOYSA-N
- Chemical structure:
View 3d structure (requires JavaScript / HTML 5) - Other names: 3,5-Di-tert-butyl-4-hydroxybenzoic acid, trimethylsilyl ester

Van Den Dool and Kratz RI, non-polar column, custom temperature program

Column type | Active phase | I | Reference | Comment |
---|---|---|---|---|
Capillary | VF-5MS | 1925.5 | Tret'yakov, 2008 | 30. m/0.25 mm/0.25 μm, He; Program: Multi-step temperature program; T(initial)=60C; T(final)=270C |

References

Tret'yakov, 2008
Tret'yakov, K.V.,
Retention Data. NIST Mass Spectrometry Data Center., NIST Mass Spectrometry Data Center, 2008. [all data]