2-Amino-4,6-dihydroxypyrimidine, 3TMS derivative
- Formula: C13H29N3O2Si3
- Molecular weight: 343.6448
- IUPAC Standard InChIKey: FFXIQYQJBYPZKD-UHFFFAOYSA-N
- Chemical structure:
View 3d structure (requires JavaScript / HTML 5) - Other names: 2-Amino-4,6-dihydroxypyrimidine, N-trimethylsilyl-, bis(trimethylsilyl) ether

Van Den Dool and Kratz RI, non-polar column, custom temperature program

Column type | Active phase | I | Reference | Comment |
---|---|---|---|---|
Capillary | VF-5MS | 1670.6 | Tret'yakov, 2008 | 30. m/0.25 mm/0.25 μm, He; Program: Multi-step temperature program; T(initial)=60C; T(final)=270C |

References

Tret'yakov, 2008
Tret'yakov, K.V.,
Retention Data. NIST Mass Spectrometry Data Center., NIST Mass Spectrometry Data Center, 2008. [all data]