Diethylene glyco, TMS derivative
- Formula: C7H18O3Si
- Molecular weight: 178.3015
- IUPAC Standard InChIKey: GSELFHHQQDHFIF-UHFFFAOYSA-N
- Chemical structure:
View 3d structure (requires JavaScript / HTML 5) - Other names: 2-[2-(Trimethylsilyloxy)ethoxy]ethanol; 3,6-Bisoxa-7-silaoctan-1-ol, 7,7-dimethyl-; Diethylene glycol, monotrimethylsilyl ether; Diethylene glycol, trimethylsilyl ether

Van Den Dool and Kratz RI, non-polar column, custom temperature program

Column type | Active phase | I | Reference | Comment |
---|---|---|---|---|
Capillary | VF-5MS | 1094.4 | Tret'yakov, 2008 | 30. m/0.25 mm/0.25 μm, He; Program: Multi-step temperature program; T(initial)=60C; T(final)=270C |
Capillary | VF-5MS | 1094.3 | Zheng and White, 2008 | 30. m/0.25 mm/0.25 μm, He; Program: not specified |

References

Tret'yakov, 2008
Tret'yakov, K.V.,
Retention Data. NIST Mass Spectrometry Data Center., NIST Mass Spectrometry Data Center, 2008. [all data]
Zheng and White, 2008
Zheng, Y.; White, E.,
Retention Data. NIST Mass Spectrometry Data Center., NIST Mass Spectrometry Data Center, 2008. [all data]