Tridecyl acetate
- Formula: C15H30O2
- Molecular weight: 242.3975
- IUPAC Standard InChIKey: ZDRNMODJXFOYMN-UHFFFAOYSA-N
- Chemical structure:
View 3d structure (requires JavaScript / HTML 5) - Other names: n-Tridecyl acetate; Acetic acid, tridecyl ester; 1-Tridecanol, acetate

Van Den Dool and Kratz RI, non-polar column, temperature ramp

Column type | Active phase | I | Reference | Comment |
---|---|---|---|---|
Capillary | VF-5MS | 1708. | Todua, 2011 | 30. m/0.25 mm/0.25 μm, He; Tstart: 60. C; Tend: 270. C |

Van Den Dool and Kratz RI, non-polar column, custom temperature program

Column type | Active phase | I | Reference | Comment |
---|---|---|---|---|
Capillary | VF-5MS | 1711.1 | Zheng and White, 2008 | 30. m/0.25 mm/0.25 μm, He; Program: not specified |
Capillary | HP-5 | 1710. | Isidorov, Krajewska, et al., 2001 | 30. m/0.25 mm/0.25 μm, He; Program: 50C => 6C/min => 100C => 4C/min => 280C |

References

Todua, 2011
Todua, N.G.,
Retention Data. NIST Mass Spectrometry Data Center., NIST Mass Spectrometry Data Center, 2011. [all data]
Zheng and White, 2008
Zheng, Y.; White, E.,
Retention Data. NIST Mass Spectrometry Data Center., NIST Mass Spectrometry Data Center, 2008. [all data]
Isidorov, Krajewska, et al., 2001
Isidorov, V.A.; Krajewska, U.; Dubis, E.N.; Jdanova, M.A.,
Partition coefficients of alkyl aromatic hydrocarbons and esters in a hexane-acetonitrile system,
J. Chromatogr. A, 2001, 923, 1-2, 127-136, https://doi.org/10.1016/S0021-9673(01)00929-3
. [all data]