Dimethylpyrrolbis[(3-methylbut-3-en-1-yl)oxy]morphosilane
- Formula: C12H24O2Si
- Molecular weight: 228.4033
- IUPAC Standard InChIKey: QFTRGNZMNNUHCZ-UHFFFAOYSA-N
- Chemical structure:
View 3d structure (requires JavaScript / HTML 5) - Other names: Dimethyl{bis[(3-methylbut-3-en-1-yl)oxy]}silane; Silane, dimethyldi(3-methylbut-3-enyloxy)-

Van Den Dool and Kratz RI, non-polar column, custom temperature program

Column type | Active phase | I | Reference | Comment |
---|---|---|---|---|
Capillary | 5 % Phenyl methyl siloxane | 1243. | Zaikin, 2008 | Column length: 30. m; Column diameter: 0.19 mm; Program: 20C => 5C/min => 120C => 10C/min => 280C |
Capillary | VF-5MS | 1244. | Tret'yakov, 2007 | 30. m/0.25 mm/0.25 μm, He; Program: Multi-step temperature program; T(initial)=60C; T(final)=270C |

References

Zaikin, 2008
Zaikin, V.G.,
Personal Communication: Retention indices measured during the period 2007 to 2008, 2008. [all data]
Tret'yakov, 2007
Tret'yakov, K.V.,
Retention Data. NIST Mass Spectrometry Data Center., NIST Mass Spectrometry Data Center, 2007. [all data]