Androsterone, (E)-, TBDMS derivative
- Formula: C25H44O2Si
- Molecular weight: 404.7012
- IUPAC Standard InChIKey: UGWVQACEZWDYMD-UHFFFAOYSA-N
- Chemical structure:
- Other names: trans-Androsterone, tert-butyldimethylsilyl ether

Van Den Dool and Kratz RI, non-polar column, custom temperature program

Column type | Active phase | I | Reference | Comment |
---|---|---|---|---|
Capillary | VF-5MS | 2904.5 | Tret'yakov, 2007 | 30. m/0.25 mm/0.25 μm, He; Program: Multi-step temperature program; T(initial)=60C; T(final)=270C |

References

Tret'yakov, 2007
Tret'yakov, K.V.,
Retention Data. NIST Mass Spectrometry Data Center., NIST Mass Spectrometry Data Center, 2007. [all data]