5-Dodecenoic acid, (Z)-, TMS derivative
- Formula: C15H30O2Si
- Molecular weight: 270.4830
- IUPAC Standard InChIKey: MHKHFLVEYCFJDE-KHPPLWFESA-N
- Chemical structure:
View 3d structure (requires JavaScript / HTML 5) - Other names: cis-5-Dodecenoic acid, trimethylsilyl ester

Van Den Dool and Kratz RI, non-polar column, custom temperature program

Column type | Active phase | I | Reference | Comment |
---|---|---|---|---|
Capillary | VF-5MS | 1625.6 | Tret'yakov, 2007 | 30. m/0.25 mm/0.25 μm, He; Program: Multi-step temperature program; T(initial)=60C; T(final)=270C |
Capillary | VF-5MS | 1631. | Tret'yakov, 2007 | 30. m/0.25 mm/0.25 μm, He; Program: Multi-step temperature program; T(initial)=60C; T(final)=270C |

References

Tret'yakov, 2007
Tret'yakov, K.V.,
Retention Data. NIST Mass Spectrometry Data Center., NIST Mass Spectrometry Data Center, 2007. [all data]