3-Nonen-1-ol, (Z)-, TMS derivative
- Formula: C12H26OSi
- Molecular weight: 214.4197
- IUPAC Standard InChIKey: ZTIQVTYRAKYNNG-KTKRTIGZSA-N
- Chemical structure:
View 3d structure (requires JavaScript / HTML 5) - Other names: cis-3-Nonen-1-ol, trimethylsilyl ether; 1-Nonen-3-ol, trimethylsilyl ether

Van Den Dool and Kratz RI, non-polar column, custom temperature program

Column type | Active phase | I | Reference | Comment |
---|---|---|---|---|
Capillary | VF-5MS | 1266.7 | Tret'yakov, 2008 | 30. m/0.25 mm/0.25 μm, He; Program: Multi-step temperature program; T(initial)=60C; T(final)=270C |
Capillary | VF-5MS | 1272. | Tret'yakov, 2007 | 30. m/0.25 mm/0.25 μm, He; Program: Multi-step temperature program; T(initial)=60C; T(final)=270C |

References

Tret'yakov, 2008
Tret'yakov, K.V.,
Retention Data. NIST Mass Spectrometry Data Center., NIST Mass Spectrometry Data Center, 2008. [all data]
Tret'yakov, 2007
Tret'yakov, K.V.,
Retention Data. NIST Mass Spectrometry Data Center., NIST Mass Spectrometry Data Center, 2007. [all data]