L-(-)-Arabitol, pentamethyl ether
- Formula: C10H22O5
- Molecular weight: 222.2787
- IUPAC Standard InChIKey: UKACKIRJWDAFEZ-UHFFFAOYSA-N
- Chemical structure:
View 3d structure (requires JavaScript / HTML 5) - Species with the same structure:
- Other names: 1,2,3,4,5-Penta-O-methyl-l-arabinitol; Arabitol permethyl; D-(+)-Arabitol, pentamethyl ether

Van Den Dool and Kratz RI, non-polar column, custom temperature program

Column type | Active phase | I | Reference | Comment |
---|---|---|---|---|
Capillary | VF-5MS | 1314.4 | Tret'yakov, 2007 | 30. m/0.25 mm/0.25 μm, He; Program: Multi-step temperature program; T(initial)=60C; T(final)=270C |
Capillary | VF-5MS | 1314. | Tret'yakov, 2007 | 30. m/0.25 mm/0.25 μm, He; Program: Multi-step temperature program; T(initial)=60C; T(final)=270C |
Capillary | DB-1 | 1304. | Yang and Cashman, 1992 | 30. m/0.32 mm/1.0 μm, He; Program: 3 min at 100 0C; 100 - 200 0C at 8 deg/min; 1 min at 200 0C; 200 - 280 0C at 5 deg/min; 30 min at 280 0C |

References

Tret'yakov, 2007
Tret'yakov, K.V.,
Retention Data. NIST Mass Spectrometry Data Center., NIST Mass Spectrometry Data Center, 2007. [all data]
Yang and Cashman, 1992
Yang, Z.C.; Cashman, J.R.,
Structure-retention index relationships for derivatized monosaccharides on non-polar gas chromatography columns,
J. Chromatogr., 1992, 596, 1, 79-84, https://doi.org/10.1016/0021-9673(92)80205-9
. [all data]