Androsterone, (E)-, TMS derivative
- Formula: C22H38O2Si
- Molecular weight: 362.6214
- IUPAC Standard InChIKey: RKALSSDGCWGKHQ-UHFFFAOYSA-N
- Chemical structure:
- Other names: trans-Androsterone, trimethylsilyl ether

Van Den Dool and Kratz RI, non-polar column, custom temperature program

Column type | Active phase | I | Reference | Comment |
---|---|---|---|---|
Capillary | VF-5MS | 2640.4 | Tret'yakov, 2007 | 30. m/0.25 mm/0.25 μm, He; Program: Multi-step temperature program; T(initial)=60C; T(final)=270C |

References

Tret'yakov, 2007
Tret'yakov, K.V.,
Retention Data. NIST Mass Spectrometry Data Center., NIST Mass Spectrometry Data Center, 2007. [all data]