Phenol, 2,5-dichloro, TMS
- Formula: C9H12Cl2OSi
- Molecular weight: 235.182
- IUPAC Standard InChIKey: ZCUPEMVXIWKCSF-UHFFFAOYSA-N
- Chemical structure:
View 3d structure (requires JavaScript / HTML 5) - Other names: 2,5-Dichlorophenol, trimethylsilyl ether

Kovats' RI, non-polar column, isothermal

Column type | Active phase | Temperature (C) | I | Reference | Comment |
---|---|---|---|---|---|
Capillary | SE-30 | 180. | 1359. | Shakirov, Tsypysheva, et al., 1988 | Column length: 20. m; Column diameter: 0.2 mm |

Van Den Dool and Kratz RI, non-polar column, temperature ramp

Column type | Active phase | I | Reference | Comment |
---|---|---|---|---|
Packed | OV-1 | 1324. | Mattsson and Petersson, 1977 | N2, Supelcoport, 4. K/min; Column length: 2. m; Tstart: 80. C; Tend: 240. C |

Van Den Dool and Kratz RI, non-polar column, custom temperature program

Column type | Active phase | I | Reference | Comment |
---|---|---|---|---|
Capillary | VF-5MS | 1356.2 | Tret'yakov, 2007 | 30. m/0.25 mm/0.25 μm, He; Program: Multi-step temperature program; T(initial)=60C; T(final)=270C |

References

Shakirov, Tsypysheva, et al., 1988
Shakirov, L.G.; Tsypysheva, L.G.; Suleimamova, R.A.; Naimushin, A.I.; Tsypyshev, O.Yu.,
Gas chromatographic determination of the products of the synthesis of chlorine-substituted salicylic acids,
Zh. Anal. Khim., 1988, 43, 143-146. [all data]
Mattsson and Petersson, 1977
Mattsson, M.; Petersson, G.,
Reference GLC Data for the Analysis of Phenolic Compounds as Trimethylsilyl Derivatives,
J. Chromatogr. Sci., 1977, 15, 12, 546-554, https://doi.org/10.1093/chromsci/15.12.546
. [all data]
Tret'yakov, 2007
Tret'yakov, K.V.,
Retention Data. NIST Mass Spectrometry Data Center., NIST Mass Spectrometry Data Center, 2007. [all data]