(E,Z)-α-Farnesene
- Formula: C15H24
- Molecular weight: 204.3511
- IUPAC Standard InChIKey: CXENHBSYCFFKJS-DZKMRSEMSA-N
- Chemical structure:
View 3d structure (requires JavaScript / HTML 5) - Species with the same structure:
- Stereoisomers:
- Other names: (3E,6Z)-α-Farnesene

Kovats' RI, non-polar column, temperature ramp

Column type | Active phase | I | Reference | Comment |
---|---|---|---|---|
Capillary | DB-1 | 1483. | Mevy, Bessiere, et al., 2002 | He, 3. K/min; Column length: 25. m; Column diameter: 0.2 mm; Tstart: 60. C; Tend: 220. C |

Van Den Dool and Kratz RI, non-polar column, temperature ramp

Column type | Active phase | I | Reference | Comment |
---|---|---|---|---|
Capillary | CP Sil 5 CB | 1475. | Ziegenbein, Hanssen, et al., 2006 | 25. m/0.25 mm/0.4 μm, He, 10. K/min; Tstart: 80. C; Tend: 270. C |

Van Den Dool and Kratz RI, polar column, custom temperature program

Column type | Active phase | I | Reference | Comment |
---|---|---|---|---|
Capillary | CP-Wax 52CB | 1726. | Romeo, Ziino, et al., 2007 | 60. m/0.25 mm/0.25 μm, He; Program: 45C(5min) => 10C/min => 80C => 2C/min => 240C |

Normal alkane RI, non-polar column, temperature ramp

Column type | Active phase | I | Reference | Comment |
---|---|---|---|---|
Capillary | HP-5 MS | 1497. | Lazarevic, Radulovic, et al., 2010 | 30. m/0.25 mm/0.25 μm, Helium, 5. K/min; Tstart: 70. C; Tend: 290. C |
Capillary | DB-5 | 1477. | Miyazawa and Tamura, 2007 | 30. m/0.25 mm/0.25 μm, He, 2. K/min; Tstart: 60. C; Tend: 240. C |

Normal alkane RI, non-polar column, custom temperature program

Column type | Active phase | I | Reference | Comment |
---|---|---|---|---|
Capillary | DB-5 | 1481. | Courtois, Paine, et al., 2009 | 30. m/0.25 mm/0.25 μm, Helium; Program: 50 0C m6 0C/min -> 140 0C 5 0C/min -> 160 0C (1 min) 10 0C/min -> 200 0C |
Capillary | HP-5 | 1518. | Custer, 2009 | 25. m/0.32 mm/0.17 μm, Helium; Program: 60 0C (5 min) 4 0C/min -> 220 0C 11 0C/min -> 280 0C (15 min) |
Capillary | HP-5 | 1498. | Custer, 2009 | 25. m/0.32 mm/0.17 μm, Helium; Program: not specified |
Capillary | SE-30 | 1492. | Vinogradov, 2004 | Program: not specified |
Capillary | Methyl Silicone | 1492. | Zenkevich, 1996 | Program: not specified |

Normal alkane RI, polar column, temperature ramp

Column type | Active phase | I | Reference | Comment |
---|---|---|---|---|
Capillary | TC-Wax | 1688. | Miyazawa and Tamura, 2007 | 60. m/0.25 mm/0.25 μm, He, 2. K/min; Tstart: 60. C; Tend: 240. C |
Capillary | Supelcowax-10 | 1722. | Ramaswami, Briscese, et al., 1988 | 50. C @ 2. min, 4. K/min, 240. C @ 10. min; Column length: 30. m |
Capillary | Supelcowax-10 | 1722. | Ramaswami, Briscese, et al., 1986 | He, 50. C @ 2. min, 4. K/min, 240. C @ 10. min; Column length: 30. m |

Normal alkane RI, polar column, custom temperature program

Column type | Active phase | I | Reference | Comment |
---|---|---|---|---|
Capillary | Carbowax 20M | 1724. | Vinogradov, 2004 | Program: not specified |

References

Mevy, Bessiere, et al., 2002
Mevy, J.P.; Bessiere, J.-M.; Dherbomez, M.; Viano, J.,
Composition and some biological activities of the essential oils from an African pasture grass: Elionurus elegans Kunth.,
J. Agric. Food Chem., 2002, 50, 15, 4240-4243, https://doi.org/10.1021/jf0115140
. [all data]
Ziegenbein, Hanssen, et al., 2006
Ziegenbein, F.C.; Hanssen, H.-P.; König, W.A.,
Chemical constituents of the essential oils of three wood-rotting fungi,
Flavour Fragr. J., 2006, 21, 5, 813-816, https://doi.org/10.1002/ffj.1732
. [all data]
Romeo, Ziino, et al., 2007
Romeo, V.; Ziino, M.; Giuffrrida, D.; Condurso, C.; Verzera, A.,
Flavour profile of capers (Capparis spinosa L.) from the Eolian Archipelago by HS-SPME/GC?MS,
Food Chem., 2007, 101, 3, 1272-1278, https://doi.org/10.1016/j.foodchem.2005.12.029
. [all data]
Lazarevic, Radulovic, et al., 2010
Lazarevic, J.; Radulovic, N.; Palic, R.; Zlatkovic, B.,
Chemical Analusis of volatile constituents of Berula erecta (Hudson) Coville subsp. erecta (Apiaceae) from Serbia,
J. Essential Oil. Res., 2010, 22, 3, 153-156, https://doi.org/10.1080/10412905.2010.9700290
. [all data]
Miyazawa and Tamura, 2007
Miyazawa, M.; Tamura, N.,
Components of the essential oil from sprouts of Polygonum hydropiper L. ('Benitade'),
Flavour Fragr. J., 2007, 22, 3, 188-190, https://doi.org/10.1002/ffj.1779
. [all data]
Courtois, Paine, et al., 2009
Courtois, E.A.; Paine, C.E.; Blandinieres, P.-A.; Stien, D.; Bessiere, J.-M.; Houel, E.; Baraloto, C.; Chave, J.,
Diversity of the volatile organic compounds emitted by 55 species of tropical trees: a survey in French Guiana,
J. Chem. Ecol., 2009, 35, 11, 1349-1362, https://doi.org/10.1007/s10886-009-9718-1
. [all data]
Custer, 2009
Custer, Y.,
GC Volatile Components Analysis of Different Parts of Litchi chinensis (Dissertation), 2009. [all data]
Vinogradov, 2004
Vinogradov, B.A.,
Production, composition, properties and application of essential oils, 2004, retrieved from http://viness.narod.ru. [all data]
Zenkevich, 1996
Zenkevich, I.G.,
Analytical Parameters of Components of Essential Oils for their Chromatographic and Chromato-Mass Spectral Identification. Mono- and Sesquiterpenes,
Rastitelnye Resursy (Plant resources), 1996, 34, 1-2, 48-58. [all data]
Ramaswami, Briscese, et al., 1988
Ramaswami, S.K.; Briscese, P.; Gargiullo, R.J.; von Geldern, T.,
Sesquiterpene hydrocarbons: from mass confusion to orderly line-up
in Flavors and Fragrances: A World Perspective. Proceedings of the 10th International Congress of Essential Oils, Fragrances and Flavors, Lawrence,B.M.; Mookherjee,B.D.; Willis,B.J., ed(s)., Elsevier, New York, 1988, 951-980. [all data]
Ramaswami, Briscese, et al., 1986
Ramaswami, S.K.; Briscese, P.; Gargiullo, R.J.; von Geldern, T.,
Sesquiterpene hydrocarbons: from mass confusion to orderly line-up
in Flavors and Fragrances: A World Perspective, Lawrence,B.M.; Mookherjee,B.D.; Willis,B.J., ed(s)., Proceedings of the 10th International Congress of Essential Oils, Fragrances, and Flavors, Washington, DC, 1986, 951-959. [all data]