Methyl isothiocyanate

Normal alkane RI, non-polar column, custom temperature program

View large format table.

Column type Active phase I Reference Comment
CapillaryDB-5742.Afsharypuor and Arefian, 199925. m/0.25 mm/0.25 μm, Helium; Program: 60 0C 3 0C/min -> 106 0C 6 0C/min -> 280 0C

References

Afsharypuor and Arefian, 1999
Afsharypuor, S.; Arefian, J., Stachidryne and volatile isothiocyanates from the unripe fruit of Capparis spinosa L., DARU, 1999, 7, 2, 11-13. [all data]