1,3-Bis(2-hydroxyethylthio)propane, 2TMS derivative
- Formula: C13H32O2S2Si2
- Molecular weight: 340.693
- IUPAC Standard InChIKey: JGZPXHRXAVBFIB-UHFFFAOYSA-N
- Chemical structure:
View 3d structure (requires JavaScript / HTML 5) - Other names: 1,3-Bis(2-trimethylsiloxyethylthio)propane; 1,3-bis-(2-Trimethylsilyloxyethylthio)propane

Van Den Dool and Kratz RI, non-polar column, temperature ramp

Column type | Active phase | I | Reference | Comment |
---|---|---|---|---|
Capillary | SE-54 | 1990. | Kostiainen, 2000 | 25. m/0.32 mm/0.25 μm, He, 40. C @ 1. min, 10. K/min, 280. C @ 10. min |

References

Kostiainen, 2000
Kostiainen, O.,
Gas Chromatography in Screening of Chemicals Related to the Chemical Weapons Convention
in Encyclopedia of Analytical Chemistry, Meyers, R.A., ed(s)., John Wiley Sons Ltd, Chichester, 2000, 963-979. [all data]