Allyl ionone 3
- Formula: C16H24O
- Molecular weight: 232.3612
- IUPAC Standard InChIKey: FXCYGAGBPZQRJE-ZHACJKMWSA-N
- Chemical structure:

Normal alkane RI, non-polar column, custom temperature program

Column type | Active phase | I | Reference | Comment |
---|---|---|---|---|
Capillary | SE-30 | 1689. | Vinogradov, 2004 | Program: not specified |

Normal alkane RI, polar column, custom temperature program

Column type | Active phase | I | Reference | Comment |
---|---|---|---|---|
Capillary | Carbowax 20M | 2146. | Vinogradov, 2004 | Program: not specified |

References

Vinogradov, 2004
Vinogradov, B.A.,
Production, composition, properties and application of essential oils, 2004, retrieved from http://viness.narod.ru. [all data]