2-(Diisopropylamino)ethanol, TMS
- Formula: C11H27NOSi
- Molecular weight: 217.4237
- IUPAC Standard InChIKey: NCUSLCFIEFPFCF-UHFFFAOYSA-N
- Chemical structure:
View 3d structure (requires JavaScript / HTML 5) - Other names: 2-Diisopropylaminoethanol, TMS derivative; 2-(Diisopropylamino)ethyl trimethylsilyl ether; (diisopropylamino)ethanol, TMS

Van Den Dool and Kratz RI, non-polar column, temperature ramp

Column type | Active phase | I | Reference | Comment |
---|---|---|---|---|
Capillary | CP Sil 8 CB | 1169.48 | Jagadeshwar Reddy, Prabhakar, et al., 2006 | 30. m/0.25 mm/0.25 μm, He, 50. C @ 5. min, 10. K/min, 300. C @ 2. min |
Capillary | SE-54 | 1171. | Kostiainen, 2000 | 25. m/0.32 mm/0.25 μm, He, 40. C @ 1. min, 10. K/min, 280. C @ 10. min |

Normal alkane RI, non-polar column, custom temperature program

Column type | Active phase | I | Reference | Comment |
---|---|---|---|---|
Capillary | 5 % Phenyl methyl siloxane | 1171. | OPCW, 1997 | Program: not specified |

References

Jagadeshwar Reddy, Prabhakar, et al., 2006
Jagadeshwar Reddy, T.; Prabhakar, S.; Ravi Kumar, M.; Vijaya Saradhi, U.V.R.; Vairamani, M.,
Mass spectral studies of a series of N,N-dialkyl aminoethyl-2-chlorides and trimethyl silyl ethers of N,N-dialkyl aminoethane-2-ols under electron impact conditions,
J. Mass Spectrom., 2006, 41, 1, 59-70, https://doi.org/10.1002/jms.946
. [all data]
Kostiainen, 2000
Kostiainen, O.,
Gas Chromatography in Screening of Chemicals Related to the Chemical Weapons Convention
in Encyclopedia of Analytical Chemistry, Meyers, R.A., ed(s)., John Wiley Sons Ltd, Chichester, 2000, 963-979. [all data]
OPCW, 1997
OPCW,
Conference of the States Parties C-I/DEC.64 (22 May 1997), 1997, retrieved from http://www.opcw.org/html/global/cseries/csp1/CIDEC64.html. [all data]