Exo-tricyclo[5.2.1.0(2.6)]decane
- Formula: C10H16
- Molecular weight: 136.2340
- IUPAC Standard InChIKey: LPSXSORODABQKT-UHFFFAOYSA-N
- Chemical structure:
View 3d structure (requires JavaScript / HTML 5) - Species with the same structure:
- Other names: Dicyclopentadiene, tetrahydro, endo

Kovats' RI, non-polar column, isothermal

Column type | Active phase | Temperature (C) | I | Reference | Comment |
---|---|---|---|---|---|
Capillary | Squalane | 60. | 1071. | Stopp, Engewald, et al., 1978 | Column length: 70. m; Column diameter: 0.23 mm |

References

Stopp, Engewald, et al., 1978
Stopp, I.; Engewald, W.; Kühn, H.; Welsch, Th.,
Molekülstruktur und retentionsverhalten. VIII. Zum gaschromatographischen retentionsverhalten von dicyclopentadienderivaten,
J. Chromatogr., 1978, 147, 21-30, https://doi.org/10.1016/S0021-9673(00)85113-4
. [all data]