2-Isopropylidene-3-methylhexa-3,5-dienal
- Formula: C10H14O
- Molecular weight: 150.2176
- IUPAC Standard InChIKey: NIEPGDUXTWPJLS-RMKNXTFCSA-N
- Chemical structure:
View 3d structure (requires JavaScript / HTML 5) - Permanent link for this species. Use this link for bookmarking this species for future reference.

Normal alkane RI, non-polar column, custom temperature program

Column type | Active phase | I | Reference | Comment |
---|---|---|---|---|
Capillary | HP-5 MS | 1164. | Jalali-Heravi, Parastar, et al., 2009 | 60. m/0.25 mm/0.25 μm, Helium; Program: 60 0C ( 1 min) 5 0C/min -> 200 0C (1 min) 20 0C/min -> 280 0C (21 min) |

References

Jalali-Heravi, Parastar, et al., 2009
Jalali-Heravi, M.; Parastar, H.; Ebrahimi-Najafabadi, H.,
Chracterization of volatile components of Iranian saffron using factorial-based response surface modeling of ultrasonic extraction combined with gas chromatography - mass spectrometry analysis,
J. Chromatogr. A, 2009, 1216, 33, 6088-6097, https://doi.org/10.1016/j.chroma.2009.06.067
. [all data]