4-Chloroundecanoic acid, chloromethyl ester

Kovats' RI, polar column, isothermal

Data compiled by: NIST Mass Spectrometry Data Center, William E. Wallace, director

Column type CapillaryCapillaryCapillary
Active phase Carbowax 20MCarbowax 20MCarbowax 20M
Column length (m) 22.22.22.
Carrier gas N2N2N2
Substrate
Column diameter (mm) 0.30.30.3
Phase thickness (μm)
Temperature (C) 160.180.200.
I 2326.2344.2348.
ReferenceHaken, Madden, et al., 1984Haken, Madden, et al., 1984Haken, Madden, et al., 1984
Comment MSDC-RI MSDC-RI MSDC-RI

References

Haken, Madden, et al., 1984
Haken, J.K.; Madden, B.G.; Korhonen, I.O.O., Gas chromatography of homologous esters. XXVI. Capillary column studies of the chloromethyl esters of C5-C12 n-carboxylic acids, J. Chromatogr., 1984, 298, 150-158, https://doi.org/10.1016/S0021-9673(01)92703-7 . [all data]