3-Heptadecene, (Z)-
- Formula: C17H34
- Molecular weight: 238.4519
- IUPAC Standard InChIKey: YICJXYRVTBRLKS-ALCCZGGFSA-N
- Chemical structure:
View 3d structure (requires JavaScript / HTML 5) - Stereoisomers:
- Other names: cis-3-Heptadecene; (Z)-3-Heptadecene

Kovats' RI, non-polar column, isothermal

Column type | Active phase | Temperature (C) | I | Reference | Comment |
---|---|---|---|---|---|
Capillary | Apolane | 160. | 1687.4 | Soják, Krupcík, et al., 1980 | N2 or H2; Column length: 250. m; Column diameter: 0.25 mm |
Capillary | Apiezon L | 154. | 1688.7 | Soják, Krupcík, et al., 1980 | N2 or H2; Column length: 250. m; Column diameter: 0.25 mm |

Kovats' RI, non-polar column, temperature ramp

Column type | Active phase | I | Reference | Comment |
---|---|---|---|---|
Packed | Apiezon L | 1692. | Youngblood, Blumer, et al., 1971 | Chromosorb W, 4. K/min; Column length: 3.0 m; Tstart: 80. C; Tend: 290. C |

Kovats' RI, polar column, isothermal

Column type | Active phase | Temperature (C) | I | Reference | Comment |
---|---|---|---|---|---|
Capillary | PEG-20M | 110. | 1723. | Rang, Orav, et al., 1988 | |
Capillary | Carbowax 20M | 110. | 1722.6 | Soják, Krupcík, et al., 1980 | N2; Column length: 300. m; Column diameter: 0.25 mm |

Kovats' RI, polar column, temperature ramp

Column type | Active phase | I | Reference | Comment |
---|---|---|---|---|
Packed | FFAP | 1756. | Youngblood, Blumer, et al., 1971 | Chromosorb W, 4. K/min; Column length: 3.0 m; Tstart: 80. C; Tend: 290. C |

References

Soják, Krupcík, et al., 1980
Soják, L.; Krupcík, J.; Janák, J.,
Gas chromatography of all C15-C18 linear alkenes on capillary columns with very high resolution power,
J. Chromatogr., 1980, 195, 1, 43-64, https://doi.org/10.1016/S0021-9673(00)81542-3
. [all data]
Youngblood, Blumer, et al., 1971
Youngblood, W.W.; Blumer, M.; Guillard, R.L.; Fiore, F.,
Saturated and unsaturated hydrocarbons in marine benthic algae,
Marine Biology, 1971, 8, 3, 190-201, https://doi.org/10.1007/BF00355215
. [all data]
Rang, Orav, et al., 1988
Rang, S.A.; Orav, A.E.; Kuningas, K.R.; Meister, A.E.; Strense, T.V.; Eisen, O.G.,
Gas-Chromatographic Characteristics of unsaturated hydrocarbons, Academy of Sciences of Estonia SSR, Tallinn, Estonia SSR, 1988, 208. [all data]